Xcode Clang Error

Clang + OpenMP Setup in Xcode – Anton Menshov

Clang + OpenMP Setup in Xcode – Anton Menshov

Xcode problem - Command /usr/bin/codesign failed with exit code 1

Xcode problem - Command /usr/bin/codesign failed with exit code 1

SOLVED] Fix Apple Mach-O Linker Error in Simple Steps - MacMetric

SOLVED] Fix Apple Mach-O Linker Error in Simple Steps - MacMetric

Linking library: Mach-O linker error - Help: Expo SDK - Forums

Linking library: Mach-O linker error - Help: Expo SDK - Forums

How to fix Git error 'invalid active developer path' after MacOS

How to fix Git error 'invalid active developer path' after MacOS

Xcode 5 x: clang: error: invalid version number in '-mmacosx-version

Xcode 5 x: clang: error: invalid version number in '-mmacosx-version

Xcode 10 2, macOS Mojave 10 14 4, iOS 12 1 and other betas / Badoo

Xcode 10 2, macOS Mojave 10 14 4, iOS 12 1 and other betas / Badoo

RE: [fltk general] Xcode 7  fltk-1 3 3  Undefined symbols and clang

RE: [fltk general] Xcode 7 fltk-1 3 3 Undefined symbols and clang

Fix

Fix "error: command 'clang' failed with exit status 1" « Dark Launch

Legacy] Flushing iOS 7 Code Coverage Data • Quality Coding

Legacy] Flushing iOS 7 Code Coverage Data • Quality Coding

Duplicate Symbols For Architecture X86 64 Xcode 10 - Works Best

Duplicate Symbols For Architecture X86 64 Xcode 10 - Works Best

entry point (_main) undefined - Error after briefly opening project

entry point (_main) undefined - Error after briefly opening project

Building and archiving detached app iOS Mac fails - Help: Expo SDK

Building and archiving detached app iOS Mac fails - Help: Expo SDK

Getting Started With Qt and Qt Creator on MacOS | ICS

Getting Started With Qt and Qt Creator on MacOS | ICS

Solving the clang version error on Mac OS X – The Coding Pad

Solving the clang version error on Mac OS X – The Coding Pad

Switching Swift Versions inside Xcode using Toolchains – XCBLOG

Switching Swift Versions inside Xcode using Toolchains – XCBLOG

Silencing Specific Build Warnings | Dave DeLong

Silencing Specific Build Warnings | Dave DeLong

Native linking failed: clang error: cannot specify -o when

Native linking failed: clang error: cannot specify -o when

ios错误clang: error: linker command failed with exit code 1 (use -v

ios错误clang: error: linker command failed with exit code 1 (use -v

Running Xcode 9 and Xcode 10 Side-by-side

Running Xcode 9 and Xcode 10 Side-by-side

How to Install the Command Line Developer Tools Without Xcode « Mac

How to Install the Command Line Developer Tools Without Xcode « Mac

Lỗi chạy code trong Sublime Text -> Clang: error: no input files

Lỗi chạy code trong Sublime Text -> Clang: error: no input files

Apple LLVM 5 1 Error - C++ - Cocos Forums

Apple LLVM 5 1 Error - C++ - Cocos Forums

All about Missing dSYMs — Fabric for Apple documentation

All about Missing dSYMs — Fabric for Apple documentation

clang:-1: linker command failed with exit code 1 (use -v to see

clang:-1: linker command failed with exit code 1 (use -v to see

iOS clang: error Xcode 7 3 1 - Stack Overflow

iOS clang: error Xcode 7 3 1 - Stack Overflow

XCode 8: Debug Error No Such File or Directory - YouTube

XCode 8: Debug Error No Such File or Directory - YouTube

Enabling the Address Sanitizer | Apple Developer Documentation

Enabling the Address Sanitizer | Apple Developer Documentation

Mac OS X: Install GCC Compiler with Xcode - nixCraft

Mac OS X: Install GCC Compiler with Xcode - nixCraft

Xcode link issue  CURRENT_ARCH not correct - Autodesk Community

Xcode link issue CURRENT_ARCH not correct - Autodesk Community

Using CGAL and Xcode | Ken Arroyo Ohori

Using CGAL and Xcode | Ken Arroyo Ohori

sierra - Why am I getting an “invalid active developer path” when

sierra - Why am I getting an “invalid active developer path” when

Error when building SampleScene from ARFoundation to iPhone 6s

Error when building SampleScene from ARFoundation to iPhone 6s

clang: error: linker command failed with exit code 1 (Cocoapods

clang: error: linker command failed with exit code 1 (Cocoapods

Simple C++: From Makefiles to Xcode Builds - Hiltmon

Simple C++: From Makefiles to Xcode Builds - Hiltmon

0 11 — Configuring your compiler: Warning and error levels | Learn C++

0 11 — Configuring your compiler: Warning and error levels | Learn C++

Apple Mac OS X — Metaproject 'combo trunk' at r174903

Apple Mac OS X — Metaproject 'combo trunk' at r174903

SR-7243] Fatal error compiling w/4 1

SR-7243] Fatal error compiling w/4 1 "Emergency spill slot is out of

Build HelloWorld error - Beginner Questions - ITK

Build HelloWorld error - Beginner Questions - ITK

Clion doesn't compile on MACOS Mojave 10 14 – IDEs Support (IntelliJ

Clion doesn't compile on MACOS Mojave 10 14 – IDEs Support (IntelliJ

iOS Build Always fails · Issue #174 · microsoft/appcenter · GitHub

iOS Build Always fails · Issue #174 · microsoft/appcenter · GitHub

18 10 community edition on Mac OS 10 13 6 - User Forums

18 10 community edition on Mac OS 10 13 6 - User Forums

How to Install Command Line Tools in Mac OS X (Without Xcode)

How to Install Command Line Tools in Mac OS X (Without Xcode)

iOS错误-Apple-LLVM 6 0 Error (Command /Applications/Xcode app

iOS错误-Apple-LLVM 6 0 Error (Command /Applications/Xcode app

Compiler Warnings for Objective-C Developers – Ole Begemann

Compiler Warnings for Objective-C Developers – Ole Begemann

Preparing Your App to Work with Pointer Authentication | Apple

Preparing Your App to Work with Pointer Authentication | Apple

Creating and Distributing an iOS Binary Framework | Instabug Blog

Creating and Distributing an iOS Binary Framework | Instabug Blog

Quick Tutorial: Configure CLion on macOS - Help | CLion

Quick Tutorial: Configure CLion on macOS - Help | CLion

The Undefined Behavior Sanitizer - Luciano Almeida - Medium

The Undefined Behavior Sanitizer - Luciano Almeida - Medium

Can't compile using CMake on macOS 10 12 with Xcode 8 - The Battle

Can't compile using CMake on macOS 10 12 with Xcode 8 - The Battle

How to Install the Command Line Developer Tools Without Xcode « Mac

How to Install the Command Line Developer Tools Without Xcode « Mac

iOS错误-Apple-LLVM 6 0 Error (Command /Applications/Xcode app

iOS错误-Apple-LLVM 6 0 Error (Command /Applications/Xcode app

Xcode error when archiving - Undefined symbols - Unity Answers

Xcode error when archiving - Undefined symbols - Unity Answers

How to install Xcode, Homebrew, Git, RVM, Ruby & Rails on Mac OS X

How to install Xcode, Homebrew, Git, RVM, Ruby & Rails on Mac OS X

iOS and Android setup on MacOS - Build Failed when trying to set up

iOS and Android setup on MacOS - Build Failed when trying to set up

Ld Symbol S Not Found For Architecture Arm64 Clang Error - Works

Ld Symbol S Not Found For Architecture Arm64 Clang Error - Works

Clang static analyzer integrated in Xcode  | Download Scientific Diagram

Clang static analyzer integrated in Xcode | Download Scientific Diagram

Opencv My first programme on Xcode Linker Errors - OpenCV Q&A Forum

Opencv My first programme on Xcode Linker Errors - OpenCV Q&A Forum

Advanced Debugging with Xcode and LLDB - WWDC 2018 - Videos - Apple

Advanced Debugging with Xcode and LLDB - WWDC 2018 - Videos - Apple

Clang Analyzer - A Great Cross-Platform C Static Analyzer - malloc co

Clang Analyzer - A Great Cross-Platform C Static Analyzer - malloc co

Error reading 'pic': Xcode6/cocoapods analyzer error

Error reading 'pic': Xcode6/cocoapods analyzer error

Translating an ARM iOS App to Intel macOS Using Bitcode

Translating an ARM iOS App to Intel macOS Using Bitcode

Enable bitcode for Frameworks in Xcode - English Only - iOSRE

Enable bitcode for Frameworks in Xcode - English Only - iOSRE

Xcode 10 2, macOS Mojave 10 14 4, iOS 12 1 and other betas / Badoo

Xcode 10 2, macOS Mojave 10 14 4, iOS 12 1 and other betas / Badoo

Improving Your Build Time in Xcode 10 · Patrick Balestra

Improving Your Build Time in Xcode 10 · Patrick Balestra

Testing Without Xcode: It's Everywhere You Want to Be

Testing Without Xcode: It's Everywhere You Want to Be

It Looks Like You Are Trying to Use a Framework - Digital product

It Looks Like You Are Trying to Use a Framework - Digital product

UP lol: 升級到xcode4 5後facebook sdk有遇到問題

UP lol: 升級到xcode4 5後facebook sdk有遇到問題

XCode 8: Debug Error No Such File or Directory

XCode 8: Debug Error No Such File or Directory

Haven't seen this XCode error before   : programming

Haven't seen this XCode error before : programming

Apple releases Xcode 7 3 1 GM with bug fixes to developers - 9to5Mac

Apple releases Xcode 7 3 1 GM with bug fixes to developers - 9to5Mac

Simple C++: From Makefiles to Xcode Builds - Hiltmon

Simple C++: From Makefiles to Xcode Builds - Hiltmon

Cannot build cocos2dx v2 project after Xcode 8 update - C++ - Cocos

Cannot build cocos2dx v2 project after Xcode 8 update - C++ - Cocos

Unity Lessons - Xcode - How to Fix Mach-O Linker Errors when Building in  Xcode from Unity

Unity Lessons - Xcode - How to Fix Mach-O Linker Errors when Building in Xcode from Unity

XCode 4 2 linker error Library not found -lFlurryAnalytics - Stack

XCode 4 2 linker error Library not found -lFlurryAnalytics - Stack

Unity - Manual: Troubleshooting on iOS devices

Unity - Manual: Troubleshooting on iOS devices

Compiling on Mac OSX - CloudCompare forum

Compiling on Mac OSX - CloudCompare forum

0 11 — Configuring your compiler: Warning and error levels | Learn C++

0 11 — Configuring your compiler: Warning and error levels | Learn C++

It Looks Like You're Still Trying to Use a Framework - Digital

It Looks Like You're Still Trying to Use a Framework - Digital

Automation Tool failed to run successfully - UE4 AnswerHub

Automation Tool failed to run successfully - UE4 AnswerHub

Creating clang plugin | Railsware Blog

Creating clang plugin | Railsware Blog

Install Code Blocks on Mac OS X and run your first C program

Install Code Blocks on Mac OS X and run your first C program

Compile and test an iOS app from the command line

Compile and test an iOS app from the command line

Taking Control of Xcode Issue Navigator with XcodeIssueGenerator

Taking Control of Xcode Issue Navigator with XcodeIssueGenerator

命令行clang编译找不到Foundation framework - Dev Discussion | 开发

命令行clang编译找不到Foundation framework - Dev Discussion | 开发